it-swarm.dev

build.gradle

Uruchomienie demona stopniowego, 1 zajętego i 6 zatrzymanych demonów nie mogło być ponownie użyte, użyj --status, aby uzyskać szczegółowe informacje

Element równorzędny nie został uwierzytelniony podczas importowania projektu Gradle w środowisku Eclipse

Problem z pamięcią po aktualizacji buildToolsVersion '23 .0.1 'w studiu Android

Android: Wykonanie nie powiodło się dla zadania ': app: processDebugResources'

Android Studio 3 + Gradle 4.0 + shrinkResources + libraryProject = Nie można znaleźć pasującej konfiguracji w projekcie

Android Studio - Błąd: typ programu jest już obecny

AGPBI: {„kind”: „error”, „text”: „Typ programu już obecny: com.google.common.annotations.GwtCompatible”, „sources”: [{}], „tool”: „D8”}

Android Studio: Nie znaleziono wtyczki o identyfikatorze „biblioteka Androida”)

Zainstaluj / zaktualizuj stopień w systemie Mac OS X

Android Stopień Studio zajmuje zbyt dużo czasu, aby zbudować

Jak ręcznie włączyć zewnętrzny pakiet aar za pomocą nowego systemu Gradle Android Build

jak dodać datę do wersji versionNameSuffix na gradle

Jak dodać zależność lokalnego pliku .jar do pliku build.gradle?

Wymuś Android Studio, aby pobrać i zainstalować gradle 1.10 lub 1.1

Android Studio Nieobsługiwana wersja wtyczki Gradle

Jak dostosować nazwę pliku APK dla smaków produktu?

Nie można znaleźć właściwości 'outputFile' na com.Android.build.gradle.internal.api.ApplicationVariantImpl

Jak dodać opcje kompilatora Java podczas kompilacji za pomocą wtyczki Gradle dla Androida?

Nie można zainstalować dystrybucji Gradle z „https://services.gradle.org/distributions/gradle-2.1-all.Zip”

Android Studio - błąd synchronizacji Gradle

Pod warunkiem, że zależność Gradle to AAR, a nie JAR

Konflikt z zależnością "com.Android.support:support-annotations". Rozwiązane wersje aplikacji (23.1.0) i aplikacji testowej (23.0.1) różnią się

Błąd: nie można znaleźć celu za pomocą ciągu mieszania „Android-21”

Błąd: nieznany host services.gradle.org. Może być konieczne dostosowanie ustawień proxy w Gradle

skonfigurowanie projektu „: app” nie powiodło się w wersji Build Tools

Błąd podczas konwersji kodu bajtowego na dex: Przyczyna: Java.lang.RuntimeException: klasy analizowania wyjątków - Android studio 2.0 beta 6

Stopień kompilacji Androida jest zbyt wolny (rozdzielczość zależności)

Błąd: konflikt z zależnością "com.google.code.findbugs: jsr305"

Wiele plików dex definiuje Lcom/google/firebase/FirebaseException

Błąd: Wykonanie nie powiodło się dla zadania „: app: prepareDebugAndroidTestDependencies”. > Błąd zależności. Szczegółowe informacje można znaleźć w konsoli

Błąd: Nie można zmienić zależności konfiguracji „: app: _debugAnnotationProcessor” po jej rozwiązaniu

Jak określić zgodność źródła i celu w module Java?

transformClassesAndResourcesWithProguardForRelease FAILED

Jak wykluczyć niektóre pliki z kompilacji stopniowych Android Studio?

Gradle 4.0 Nie można znaleźć pasującej konfiguracji

React Native Generation Signed APK „KeyStore plik nie jest ustawiony do podpisywania wersji konfiguracyjnej”

Jaka jest różnica między implementacją a kompilacją w Gradle?

Android Studio 3.0 Beta 1: Nie udało się rozwiązać: com.Android.support:multidex:1.0.2

W gradle: 3.0.0 Znaleziono więcej niż jeden plik z niezależną od systemu operacyjnego ścieżką „META-INF/ASL2.0”

Android Gradle - Czego używać zamiast kompilacji?

Właściwość CompileOptions.bootClasspath została wycofana

Powielona wartość dla zasobu „attr/tint”

Android Nie można powiadomić odbiorcy oceny projektu

AppCompatDelegate Nie można utworzyć instancji widoku niestandardowego nadmiarowego Android.support.v7.app.AppCompatViewInflater

Android Gradle Sync nie udało się znaleźć support-core-ui.aar

Nie można rozwiązać zależności dla „: app @ debug/compileClasspath”: Nie można rozwiązać com.google.Android.gms: play-services-basement: [15.0.0,16.0.0)

com.Android.builder.dexing.DexArchiveBuilderException: Nie można przetworzyć.

org.gradle.api.UncheckedIOException: Nie udało się przechwycić migawki danych wejściowych

Nie powiodło się połączenie z materiałem Android i appcompat Manifest

Zmienna BuildConfig. Błąd: nie można znaleźć symbolu

Nie można znaleźć com.Android.tools:common:25.2.3

Kod Autoincrement Version z dodatkowymi właściwościami stopnia

Jaka jest składnia pisania komentarzy w pliku build.gradle?

Skopiuj istniejący projekt pod nową nazwą w Android Studio

Wymagana jest wersja 1.10. Obecna wersja to 2.0

Sposób rozwiązania wtyczki Gradle wymaga minimum Studio 3.0

Dlaczego w projekcie Android Studio) są dwa pliki build.gradle?

Jaka jest różnica między „minifyEnabled” a „useProguard” w Android Plugin dla Gradle?

Rekursywne wyszukiwanie CMake dla nagłówka i plików źródłowych

Jak czytać Gradle's registry.bin?

Android oddzielne wartości ciągów dla wersji kompilacji i debugowania

Błąd w kompilacji gradle po aktualizacji Android Studio za pomocą log4j

Android nie może się zbudować - nie można znaleźć com.Android.tools:common:25.5.0-alpha-preview-02

Kiedy używać gradle.properties vs. settings.gradle?

Jakie są różnice między Bazel a Gradle?

Co to jest Gradle w Android Studio?

Jak zastąpić ciąg znaków buildvariant gradle w studio Android?

Błąd Gradle podczas uruchamiania Android Studio

Jak powiedzieć Gradle, aby używał konkretnej wersji JDK?

Gradle, Android i lokalizacja SDK Android_HOME

Błąd w usłudze Android Studio podczas próby skompilowania działającego projektu

Studio Android, konfiguracja projektu stopniowego trwa wiecznie

Jak rozwiązać błąd Android Studio, w którym nie może znaleźć pliku manifestu projektu?

Moduł ... nie jest wspierany przez gradle

Gradle - Nie można znaleźć lub załadować głównej klasy

Która wtyczka Gradle jest odpowiednia do obsługi metody „pod warunkiem”?

Po aktualizacji - Błąd: Nie można znaleźć: com.google.Android.gms: play-services: 5.2.8

Jak otworzyć istniejący projekt Android (build.gradle) w studio Android

Aktualizacja Studio Android-Błąd: Nie można uruchomić akcji kompilacji przy użyciu dystrybucji Gradle

Zmień wygenerowaną nazwę apk z „app-debug.apk”

Plik ~/.gradle/gradle.properties nie jest odczytywany

Błąd: demon budujący Gradle zniknął nieoczekiwanie (mógł zostać zabity lub mógł ulec awarii)

Błąd: Wykonanie nie powiodło się dla zadania „: ProjectName: mergeDebugResources”. > Crunching Cruncher * niektóre pliki * nie powiodły się, zobacz dzienniki

Nie można znaleźć com.Android.support:support-v4:22.0.0. po aktualizacji SDK

Zaktualizuj wtyczkę Android Studio Gradle do ostatniej wersji

Błąd kompilacji testów Androida: wiele plików dex definiuje Landroid/support/test/BuildConfig

Wykonanie nie powiodło się dla zadania „: compileJava”. > nieprawidłowe źródło wydania: 1.7

Nie można rozwiązać symbolu „AndroidJUnit4”

Gradle Build Failure

gradle: Nie można znaleźć com.Android.support:multidex:1.0.1

Gradle nie używa repozytorium lokalnego Maven do nowej zależności

Który plik stopni należy użyć, aby ustawić aplikację jako debuggującą?

Błąd kompilacji Gradle, Błąd: Wykonanie nie powiodło się dla zadania ': app: transformResourcesWithMergeJavaResForDebug'

Błąd Gradle w Android Studio: Nie znaleziono wtyczki o identyfikatorze „com.Android.library”

Błąd: wykonanie nie powiodło się dla zadania „: app: processDebugGoogleServices”. > Popraw konflikt wersji

Błąd Gradle: wykonanie nie powiodło się dla zadania „: app: processDebugGoogleServices”

błąd app: mergeDebugResources w Android Studio po aktualizacji

Gradle nie udało się zsynchronizować z „nie można znaleźć opcjonalnej biblioteki”

Android Studio: Nie można znaleźć com.Android.tools.build:gradle:2.0.0-alpha2

Android Studio Gradle: Błąd: Wykonanie nie powiodło się dla zadania „: app: processDebugGoogleServices”. > Nie znaleziono pasującego klienta dla pakietu